Build: #7 failed Scheduled

Build result summary

Details

Completed
Duration
21 minutes
Labels
None
Revision
4dc901735ae74747806888d99d97311c937ac068 4dc901735ae74747806888d99d97311c937ac068
Failing since
#2 (Scheduled – )

No failed tests found, a possible compilation error occurred.

Responsible

This build has been failing since #2
No one has taken responsibility

Error summary for Check UAT (develop)

The job generated some errors, drill down into the full build log for more details.


BUILD FAILED
/home/bamboo/bamboo-agent-home/xml-data/build-dir/SFDC-CU-JOB1/build.xml:54: The following error occurred while executing this line:
/home/bamboo/bamboo-agent-home/xml-data/build-dir/SFDC-CU-JOB1/build.xml:119:
*********** DEPLOYMENT FAILED ***********
Request ID: 0AfQ000000DzpuYKAR

All Component Failures:
1.  reports/ARCH-meta.xml -- Error: An unexpected error occurred. Please include this ErrorId if you contact support: 36106430-477203 (101647542)

*********** DEPLOYMENT FAILED ***********


Total time: 21 minutes 9 seconds