Build #6

Build: #6 failed Manual run by Bruce Meehan

Build result summary

Details

Completed
Duration
50 minutes
Labels
None
Agent
(elastic) Elastic Agent on i-02756422b7a08c217
Revision
bb1f69334f332a5cd184121c008f156c5ff41174 bb1f69334f332a5cd184121c008f156c5ff41174
Failing since
#1 (Manual run by Bruce Meehan)

No failed tests found, a possible compilation error occurred.

Responsible

Code commits

Author Commit Message Commit date
Sean Williams Sean Williams bb1f69334f332a5cd184121c008f156c5ff41174 bb1f69334f332a5cd184121c008f156c5ff41174 Merged in feature_lightningmigration (pull request #1350)
CRM-715  Chatter Lightning Migration - Adding required ContentAsset type metadata
Bruce Meehan Bruce Meehan eebf3026b7e1d08a9f021b19c7a5fb84b85b8105 eebf3026b7e1d08a9f021b19c7a5fb84b85b8105 CRM-715 Included Chatter Lightning ContentAsset in build-lightningmigration.xml
Bruce Meehan Bruce Meehan 01f346c519b783dd42e63768b24c0759e9dac315 01f346c519b783dd42e63768b24c0759e9dac315 CRM-715 Chatter Lightning changes - Adding the Salesforce Metadata Type ContentAsset to the deployment package manifest used for Bamboo deployments
Sean Williams Sean Williams 9c4115fa292538406e634431c5025f9ec3284327 9c4115fa292538406e634431c5025f9ec3284327 Add chatter logo for lightning app
Sean Williams Sean Williams b9f79084fe41e4885c3b31c4b9a49c570d8b70f7 b9f79084fe41e4885c3b31c4b9a49c570d8b70f7 Merge remote-tracking branch 'origin/develop' into feature_lightningmigration

JIRA issues

IssueDescriptionStatus
Unknown Issue TypeCRM-680Could not obtain issue details from JIRA
Unknown Issue TypeCRM-711Could not obtain issue details from JIRA
Unknown Issue TypeCRM-715Could not obtain issue details from JIRA
Unknown Issue TypeSLI-1Could not obtain issue details from JIRA

Error summary for Continuous Integration

The job generated some errors, drill down into the full build log for more details.


BUILD FAILED
/home/bamboo/bamboo-agent-home/xml-data/build-dir/SFDC-CSF-JOB1/build.xml:769: The following error occurred while executing this line:
/home/bamboo/bamboo-agent-home/xml-data/build-dir/SFDC-CSF-JOB1/build.xml:214:
*********** DEPLOYMENT FAILED ***********
Request ID: 0Af0v00000MhWkwCAF

All Test Failures:
1.  IntranetAssetDetailControllerTest.myUnitTest -- System.NullPointerException: Argument 1 cannot be null
    Stack trace: Class.IntranetAssetDetailController.openScorm: line 261, column 1
    Class.IntranetAssetDetailControllerTest.myUnitTest: line 154, column 1
2.  MA_UserManagementControllerTest.testUserManagement -- System.LimitException: Too many SOQL queries: 101
    Stack trace: Class.MA_UserManagementController.getExportToExcel: line 489, column 1
    Class.MA_UserManagementController.ExportToExcel: line 476, column 1
    Class.MA_UserManagementControllerTest.testUserManagement: line 85, column 1
3.  PermissionGroupUnassignmentBatchTest.runPermGrpUnassignSch -- System.UnexpectedException: No more than one executeBatch can be called from within a test method.  Please make sure the iterable returned from your start method matches the batch size, resulting in one executeBatch invocation.
    Stack trace: External entry point

Code Coverage Failures:
1.  Class: ReportFinderUtil -- Test coverage of selected Apex Class is 0%, at least 75% test coverage is required
2.  Class: groupMasterBatch -- Test coverage of selected Apex Class is 61.268%, at least 75% test coverage is required
3.  Class: DisableChatterDeleteDelegate -- Test coverage of selected Apex Class is 0%, at least 75% test coverage is required
4.  Class: PicklistFieldController -- Test coverage of selected Apex Class is 0%, at least 75% test coverage is required
5.  Class: PicklistEntryWrapper -- Test coverage of selected Apex Class is 0%, at least 75% test coverage is required
6.  Class: ChatterNavPanelController -- Test coverage of selected Apex Class is 29.412%, at least 75% test coverage is required
7.  Class: EI_SOP_ClsTriggerException -- Test coverage of selected Apex Class is 0%, at least 75% test coverage is required
8.  Class: EI_SOP_ClsTriggerFactory -- Test coverage of selected Apex Class is 0%, at least 75% test coverage is required
9.  Class: EI_SOP_ClsTriggerEISOPApplicationHandler -- Test coverage of selected Apex Class is 0%, at least 75% test coverage is required
10.  Class: EI_SOP_ClsTriggerVirtual -- Test coverage of selected Apex Class is 0%, at least 75% test coverage is required
11.  Class: EI_SOP_ClsWrappers -- Test coverage of selected Apex Class is 0%, at least 75% test coverage is required
12.  Class: UpdateUserSkillDate -- Test coverage of selected Apex Trigger is 58.824%, at least 75% test coverage is required
13.  Class: az_dummy -- Test coverage of selected Apex Class is 0%, at least 75% test coverage is required
14.  Class: ChatterIdeaUpdate -- Test coverage of selected Apex Trigger is 55.172%, at least 75% test coverage is required
15.  Class: NoChatterForYouService -- Test coverage of selected Apex Class is 0%, at least 75% test coverage is required
16.  Class: IntranetAssetDetailController -- Test coverage of selected Apex Class is 40.67%, at least 75% test coverage is required
17.  Class: BatchAddUserToAllChatterGroup -- Test coverage of selected Apex Class is 0%, at least 75% test coverage is required
18.  Class: TriggerState -- Test coverage of selected Apex Class is 59.091%, at least 75% test coverage is required
*********** DEPLOYMENT FAILED ***********


Total time: 50 minutes 18 seconds