Build: #126 failed Scheduled with changes by 4 people

Build result summary

Details

Completed
Duration
47 minutes
Labels
None
Agent
(elastic) Elastic Agent on i-0d910e554d9e0c73f
Revisions
azusgb01 develop
9ca3138cc2e4a1351f24700e567436a1d225f00b 9ca3138cc2e4a1351f24700e567436a1d225f00b
azusgb01 feature_academies
deb960c89ebb81ba956fed6018a50d0feeb83aa6 deb960c89ebb81ba956fed6018a50d0feeb83aa6
Failing since
#13 (Scheduled with changes by 9 people)

No failed tests found, a possible compilation error occurred.

Responsible

Code commits

azusgb01 develop
Author Commit Message Commit date
rashmi narayanan rashmi narayanan 9ca3138cc2e4a1351f24700e567436a1d225f00b 9ca3138cc2e4a1351f24700e567436a1d225f00b Merged in feature_nucleus (pull request #1182)
NUCLEUS-1186 CRM-692
Narayanan &lt;kpnz317@astrazeneca.net&gt; Narayanan <kpnz317@astrazeneca.net> f2346d700408213afe16ebab07a37e03e0eced65 f2346d700408213afe16ebab07a37e03e0eced65 Merge remote-tracking branch 'origin/develop' into feature_nucleus
Narayanan &lt;kpnz317@astrazeneca.net&gt; Narayanan <kpnz317@astrazeneca.net> c504d48c6d2e0dad396fe6bf5cf1f7c45cec29cc m c504d48c6d2e0dad396fe6bf5cf1f7c45cec29cc NUCLEUS-1186 CRM-692
Mohammed Abdul Qadeer &lt;a.qadeer@gmail.com&gt; Mohammed Abdul Qadeer <a.qadeer@gmail.com> c55b626b268e3765cde455d6f95849080f82634f c55b626b268e3765cde455d6f95849080f82634f Merged in feature_falcon (pull request #1180)
FAL-195: Falcon 4.0 Changes to be deployed to UAT (Defect Fixes)

Approved-by: Jaiganesh Vaidyalingam <jaiganesh.vaidyalingam@astrazeneca.com>
Mohammed Abdul Qadeer(Deloitte) &lt;a.qadeer@gmail.com&gt; Mohammed Abdul Qadeer(Deloitte) <a.qadeer@gmail.com> c4e6db27ebc100f8d224685cf7ad3363d3179eb0 c4e6db27ebc100f8d224685cf7ad3363d3179eb0 FAL-195: Defect Fixes

Configuration changes

Plan configuration has changed since the last successful build. See the plan audit log for more details.

JIRA issues

IssueDescriptionStatus
Unknown Issue TypeCRM-692Could not obtain issue details from JIRA
Unknown Issue TypeFAL-195Could not obtain issue details from JIRA
Unknown Issue TypeNUCLEUS-1186Could not obtain issue details from JIRA

Error summary for Check UAT (develop)

The job generated some errors, drill down into the full build log for more details.


BUILD FAILED
/home/bamboo/bamboo-agent-home/xml-data/build-dir/SFDC-CSD-JOB1/build.xml:74: The following error occurred while executing this line:
/home/bamboo/bamboo-agent-home/xml-data/build-dir/SFDC-CSD-JOB1/build.xml:119:
*********** DEPLOYMENT FAILED ***********
Request ID: 0Af0v0000096AYECA2

All Test Failures:
1.  ChatterCompliancePostAndCommentTest.test001 -- System.DmlException: Insert failed. First exception on row 0; first error: DUPLICATE_USERNAME, Duplicate Username.<br>The username already exists in this or another Salesforce organization. Usernames must be unique across all Salesforce organizations. To resolve, use a different username (it doesn't need to match the user's email address). : [Username]
    Stack trace: Class.ChatterCompliancePostAndCommentTest.setupTestData: line 38, column 1
2.  ChatterCompliancePostAndCommentTest.test002 -- System.DmlException: Insert failed. First exception on row 0; first error: DUPLICATE_USERNAME, Duplicate Username.<br>The username already exists in this or another Salesforce organization. Usernames must be unique across all Salesforce organizations. To resolve, use a different username (it doesn't need to match the user's email address). : [Username]
    Stack trace: Class.ChatterCompliancePostAndCommentTest.setupTestData: line 38, column 1
3.  ChatterCompliancePostAndCommentTest.test003 -- System.DmlException: Insert failed. First exception on row 0; first error: DUPLICATE_USERNAME, Duplicate Username.<br>The username already exists in this or another Salesforce organization. Usernames must be unique across all Salesforce organizations. To resolve, use a different username (it doesn't need to match the user's email address). : [Username]
    Stack trace: Class.ChatterCompliancePostAndCommentTest.setupTestData: line 38, column 1
4.  GRPOwnerChangeTest.testBasic -- System.DmlException: Insert failed. First exception on row 0; first error: DUPLICATE_USERNAME, Duplicate Username.<br>The username already exists in this or another Salesforce organization. Usernames must be unique across all Salesforce organizations. To resolve, use a different username (it doesn't need to match the user's email address). : [Username]
    Stack trace: Class.GRPOwnerChangeTest.setupTestData: line 47, column 1
5.  GRPOwnerChangeTest.test003 -- System.DmlException: Insert failed. First exception on row 0; first error: DUPLICATE_USERNAME, Duplicate Username.<br>The username already exists in this or another Salesforce organization. Usernames must be unique across all Salesforce organizations. To resolve, use a different username (it doesn't need to match the user's email address). : [Username]
    Stack trace: Class.ChatterCompliancePostAndCommentTest.setupTestData: line 38, column 1
6.  GRPOwnerChangeTest.test002 -- System.DmlException: Insert failed. First exception on row 0; first error: DUPLICATE_USERNAME, Duplicate Username.<br>The username already exists in this or another Salesforce organization. Usernames must be unique across all Salesforce organizations. To resolve, use a different username (it doesn't need to match the user's email address). : [Username]
    Stack trace: Class.ChatterCompliancePostAndCommentTest.setupTestData: line 38, column 1
7.  GRPOwnerChangeTest.test001 -- System.DmlException: Insert failed. First exception on row 0; first error: DUPLICATE_USERNAME, Duplicate Username.<br>The username already exists in this or another Salesforce organization. Usernames must be unique across all Salesforce organizations. To resolve, use a different username (it doesn't need to match the user's email address). : [Username]
    Stack trace: Class.ChatterCompliancePostAndCommentTest.setupTestData: line 38, column 1
8.  IntranetAssetDetailControllerTest.myUnitTest -- System.NullPointerException: Argument 1 cannot be null
    Stack trace: Class.IntranetAssetDetailController.openScorm: line 261, column 1
    Class.IntranetAssetDetailControllerTest.myUnitTest: line 154, column 1
9.  ManagerPublicGroupMembershipTest.testRemoval -- System.DmlException: Insert failed. First exception on row 0; first error: DUPLICATE_USERNAME, Duplicate Username.<br>The username already exists in this or another Salesforce organization. Usernames must be unique across all Salesforce organizations. To resolve, use a different username (it doesn't need to match the user's email address). : [Username]
    Stack trace: Class.ManagerPublicGroupMembershipTest.setupTestData: line 53, column 1
10.  ManagerPublicGroupMembershipTest.testBulkCreate -- System.DmlException: Insert failed. First exception on row 0; first error: DUPLICATE_USERNAME, Duplicate Username.<br>The username already exists in this or another Salesforce organization. Usernames must be unique across all Salesforce organizations. To resolve, use a different username (it doesn't need to match the user's email address). : [Username]
     Stack trace: Class.ManagerPublicGroupMembershipTest.setupTestData: line 53, column 1
11.  ManagerPublicGroupMembershipTest.testBasic -- System.DmlException: Insert failed. First exception on row 0; first error: DUPLICATE_USERNAME, Duplicate Username.<br>The username already exists in this or another Salesforce organization. Usernames must be unique across all Salesforce organizations. To resolve, use a different username (it doesn't need to match the user's email address). : [Username]
     Stack trace: Class.ManagerPublicGroupMembershipTest.setupTestData: line 53, column 1
12.  ManagerPublicGroupMembershipTest.testBasic -- System.DmlException: Insert failed. First exception on row 0; first error: DUPLICATE_USERNAME, Duplicate Username.<br>The username already exists in this or another Salesforce organization. Usernames must be unique across all Salesforce organizations. To resolve, use a different username (it doesn't need to match the user's email address). : [Username]
     Stack trace: Class.GRPOwnerChangeTest.setupTestData: line 47, column 1
13.  ManagerPublicGroupMembershipTest.test003 -- System.DmlException: Insert failed. First exception on row 0; first error: DUPLICATE_USERNAME, Duplicate Username.<br>The username already exists in this or another Salesforce organization. Usernames must be unique across all Salesforce organizations. To resolve, use a different username (it doesn't need to match the user's email address). : [Username]
     Stack trace: Class.ChatterCompliancePostAndCommentTest.setupTestData: line 38, column 1
14.  ManagerPublicGroupMembershipTest.test002 -- System.DmlException: Insert failed. First exception on row 0; first error: DUPLICATE_USERNAME, Duplicate Username.<br>The username already exists in this or another Salesforce organization. Usernames must be unique across all Salesforce organizations. To resolve, use a different username (it doesn't need to match the user's email address). : [Username]
     Stack trace: Class.ChatterCompliancePostAndCommentTest.setupTestData: line 38, column 1
15.  ManagerPublicGroupMembershipTest.test001 -- System.DmlException: Insert failed. First exception on row 0; first error: DUPLICATE_USERNAME, Duplicate Username.<br>The username already exists in this or another Salesforce organization. Usernames must be unique across all Salesforce organizations. To resolve, use a different username (it doesn't need to match the user's email address). : [Username]
     Stack trace: Class.ChatterCompliancePostAndCommentTest.setupTestData: line 38, column 1
16.  MA_UserManagementControllerTest.testUserManagement -- System.LimitException: Too many SOQL queries: 101
     Stack trace: Class.MA_UserManagementController.getExportToExcel: line 489, column 1
     Class.MA_UserManagementController.ExportToExcel: line 476, column 1
     Class.MA_UserManagementControllerTest.testUserManagement: line 85, column 1
17.  ManagerPublicGroupMembershipTest1.testRemoval -- System.DmlException: Insert failed. First exception on row 0; first error: DUPLICATE_USERNAME, Duplicate Username.<br>The username already exists in this or another Salesforce organization. Usernames must be unique across all Salesforce organizations. To resolve, use a different username (it doesn't need to match the user's email address). : [Username]
     Stack trace: Class.ManagerPublicGroupMembershipTest.setupTestData: line 53, column 1
18.  ManagerPublicGroupMembershipTest1.testBulkCreate -- System.DmlException: Insert failed. First exception on row 0; first error: DUPLICATE_USERNAME, Duplicate Username.<br>The username already exists in this or another Salesforce organization. Usernames must be unique across all Salesforce organizations. To resolve, use a different username (it doesn't need to match the user's email address). : [Username]
     Stack trace: Class.ManagerPublicGroupMembershipTest.setupTestData: line 53, column 1
19.  ManagerPublicGroupMembershipTest1.testBasic -- System.DmlException: Insert failed. First exception on row 0; first error: DUPLICATE_USERNAME, Duplicate Username.<br>The username already exists in this or another Salesforce organization. Usernames must be unique across all Salesforce organizations. To resolve, use a different username (it doesn't need to match the user's email address). : [Username]
     Stack trace: Class.ManagerPublicGroupMembershipTest.setupTestData: line 53, column 1
20.  ManagerPublicGroupMembershipTest1.testBasic -- System.DmlException: Insert failed. First exception on row 0; first error: DUPLICATE_USERNAME, Duplicate Username.<br>The username already exists in this or another Salesforce organization. Usernames must be unique across all Salesforce organizations. To resolve, use a different username (it doesn't need to match the user's email address). : [Username]
     Stack trace: Class.GRPOwnerChangeTest.setupTestData: line 47, column 1
21.  ManagerPublicGroupMembershipTest1.testBulkModify -- System.DmlException: Insert failed. First exception on row 0; first error: DUPLICATE_USERNAME, Duplicate Username.<br>The username already exists in this or another Salesforce organization. Usernames must be unique across all Salesforce organizations. To resolve, use a different username (it doesn't need to match the user's email address). : [Username]
     Stack trace: Class.ManagerPublicGroupMembershipTest1.setupTestData: line 49, column 1
22.  ManagerPublicGroupMembershipTest1.test002 -- System.DmlException: Insert failed. First exception on row 0; first error: DUPLICATE_USERNAME, Duplicate Username.<br>The username already exists in this or another Salesforce organization. Usernames must be unique across all Salesforce organizations. To resolve, use a different username (it doesn't need to match the user's email address). : [Username]
     Stack trace: Class.ChatterCompliancePostAndCommentTest.setupTestData: line 38, column 1
23.  ManagerPublicGroupMembershipTest1.test003 -- System.DmlException: Insert failed. First exception on row 0; first error: DUPLICATE_USERNAME, Duplicate Username.<br>The username already exists in this or another Salesforce organization. Usernames must be unique across all Salesforce organizations. To resolve, use a different username (it doesn't need to match the user's email address). : [Username]
     Stack trace: Class.ChatterCompliancePostAndCommentTest.setupTestData: line 38, column 1
24.  ManagerPublicGroupMembershipTest1.test001 -- System.DmlException: Insert failed. First exception on row 0; first error: DUPLICATE_USERNAME, Duplicate Username.<br>The username already exists in this or another Salesforce organization. Usernames must be unique across all Salesforce organizations. To resolve, use a different username (it doesn't need to match the user's email address). : [Username]
     Stack trace: Class.ChatterCompliancePostAndCommentTest.setupTestData: line 38, column 1
25.  PermissionGroupUnassignmentBatchTest.runPermGrpUnassignSch -- System.UnexpectedException: No more than one executeBatch can be called from within a test method.  Please make sure the iterable returned from your start method matches the batch size, resulting in one executeBatch invocation.
     Stack trace: External entry point

Code Coverage Failures:
1.  Class: groupOwnerChange -- Test coverage of selected Apex Trigger is 0%, at least 1% test coverage is required
*********** DEPLOYMENT FAILED ***********


Total time: 46 minutes 54 seconds