Validating staging against feature_academies

Build: #2 failed Changes by mail4thiyagu <mail4thiyagu@gmail.com>

Build result summary

Details

Completed
Duration
50 minutes
Labels
None
Revision
22e8fa52357b1fb81121d3655555a7b2053ec17f 22e8fa52357b1fb81121d3655555a7b2053ec17f
Failing since
#1 (First build for this plan – )

No failed tests found, a possible compilation error occurred.

Responsible

This build has been failing since #1
No one has taken responsibility

Code commits

Author Commit Message Commit date
mail4thiyagu &lt;mail4thiyagu@gmail.com&gt; mail4thiyagu <mail4thiyagu@gmail.com> 22e8fa52357b1fb81121d3655555a7b2053ec17f 22e8fa52357b1fb81121d3655555a7b2053ec17f CRM-595 April academy fix

JIRA issues

IssueDescriptionStatus
Unknown Issue TypeCRM-595Could not obtain issue details from JIRA

Error summary for Default Job

The job generated some errors, drill down into the full build log for more details.


BUILD FAILED
/home/bamboo/bamboo-agent-home/xml-data/build-dir/SFDC-CS-JOB1/build.xml:74: The following error occurred while executing this line:
/home/bamboo/bamboo-agent-home/xml-data/build-dir/SFDC-CS-JOB1/build.xml:119:
*********** DEPLOYMENT FAILED ***********
Request ID: 0Af6C000009lctTSAQ

All Test Failures:
1.  MA_UserManagementControllerTest.testUserManagement -- System.LimitException: Too many SOQL queries: 101
    Stack trace: Class.MA_UserManagementController.getExportToExcel: line 489, column 1
    Class.MA_UserManagementController.ExportToExcel: line 476, column 1
    Class.MA_UserManagementControllerTest.testUserManagement: line 85, column 1
2.  PermissionGroupUnassignmentBatchTest.runPermGrpUnassignSch -- System.UnexpectedException: No more than one executeBatch can be called from within a test method.  Please make sure the iterable returned from your start method matches the batch size, resulting in one executeBatch invocation.
    Stack trace: External entry point
*********** DEPLOYMENT FAILED ***********


Total time: 50 minutes 0 seconds