Build: #4 failed Manual run by Raja Rajendran

Build result summary

Details

Completed
Duration
91 minutes
Labels
None
Revision
49152da29bce839a8bfeccedd8ac1bcbed33253c 49152da29bce839a8bfeccedd8ac1bcbed33253c
Failing since
#1 (First build for this plan – )

No failed tests found, a possible compilation error occurred.

Responsible

This build has been failing since #1
No one has taken responsibility

Code commits

Author Commit Message Commit date
mail4thiyagu &lt;mail4thiyagu@gmail.com&gt; mail4thiyagu <mail4thiyagu@gmail.com> 49152da29bce839a8bfeccedd8ac1bcbed33253c 49152da29bce839a8bfeccedd8ac1bcbed33253c CRM-595 Academy april test fix
mail4thiyagu &lt;mail4thiyagu@gmail.com&gt; mail4thiyagu <mail4thiyagu@gmail.com> 7a0ed68d6dc26dab608fa85fa50f329ca68ba10e 7a0ed68d6dc26dab608fa85fa50f329ca68ba10e CRM-595 Academy april test fix
mail4thiyagu &lt;mail4thiyagu@gmail.com&gt; mail4thiyagu <mail4thiyagu@gmail.com> 21af49f869bd611b099e6e98d58a4fa6a85a057d 21af49f869bd611b099e6e98d58a4fa6a85a057d CRM-595 Academy april test fix

JIRA issues

IssueDescriptionStatus
Unknown Issue TypeCRM-595Could not obtain issue details from JIRA

Error summary for Check Production (feature academies)

The job generated some errors, drill down into the full build log for more details.


BUILD FAILED
/home/bamboo/bamboo-agent-home/xml-data/build-dir/SFDC-CP-JOB1/build.xml:34: The following error occurred while executing this line:
/home/bamboo/bamboo-agent-home/xml-data/build-dir/SFDC-CP-JOB1/build.xml:119:
*********** DEPLOYMENT FAILED ***********
Request ID: 0Af2A00000AV4R3SAL

All Test Failures:
1.  assignPermissionSet_aInsert_aUpdateTest.assignPermissionSet_aInsert_aUpdate -- System.DmlException: Insert failed. First exception on row 0; first error: CANNOT_INSERT_UPDATE_ACTIVATE_ENTITY, NewUserAddToLangGrp: execution of AfterInsert
   
    caused by: System.DmlException: Insert failed. First exception on row 0; first error: UNABLE_TO_LOCK_ROW, unable to obtain exclusive access to this record: []
   
    Trigger.NewUserAddToLangGrp: line 71, column 1: []
    Stack trace: Class.assignPermissionSet_aInsert_aUpdateTest.assignPermissionSet_aInsert_aUpdate: line 27, column 1
2.  AssignPermissionSetsControllerTest.runTest -- System.DmlException: Insert failed. First exception on row 0; first error: CANNOT_INSERT_UPDATE_ACTIVATE_ENTITY, NewUserAddToLangGrp: execution of AfterInsert
   
    caused by: System.DmlException: Insert failed. First exception on row 0; first error: UNABLE_TO_LOCK_ROW, unable to obtain exclusive access to this record: []
   
    Trigger.NewUserAddToLangGrp: line 71, column 1: []
    Stack trace: Class.AssignPermissionSetsControllerTest.runTest: line 13, column 1
3.  AZ_ocms_NucleusNewsLoader_Test.test_nucleusFeatureLoader -- System.DmlException: Insert failed. First exception on row 0; first error: UNABLE_TO_LOCK_ROW, unable to obtain exclusive access to this record: []
    Stack trace: Class.AZ_ocms_NucleusNewsLoader_Test.test_nucleusFeatureLoader: line 129, column 1
4.  MA_UserManagementControllerTest.testUserManagement -- System.LimitException: Too many SOQL queries: 101
    Stack trace: Class.MA_UserManagementController.getExportToExcel: line 489, column 1
    Class.MA_UserManagementController.ExportToExcel: line 476, column 1
    Class.MA_UserManagementControllerTest.testUserManagement: line 85, column 1
5.  PermissionGroupUnassignmentBatchTest.runPermGrpUnassignSch -- System.UnexpectedException: No more than one executeBatch can be called from within a test method.  Please make sure the iterable returned from your start method matches the batch size, resulting in one executeBatch invocation.
    Stack trace: External entry point
*********** DEPLOYMENT FAILED ***********


Total time: 91 minutes 17 seconds