Build: #424 failed Scheduled

Build result summary

Details

Completed
Duration
19 minutes
Labels
None
Agent
(elastic) Elastic Agent on i-0695fe5eadbbfd53f
Revision
4e7d200e94de3744ee792dfc49e4a7a6042df8b4 4e7d200e94de3744ee792dfc49e4a7a6042df8b4
Failing since
#223 (Scheduled with changes by 5 people)

No failed tests found, a possible compilation error occurred.

Responsible

Configuration changes

Plan configuration has changed since the last successful build. See the plan audit log for more details.

Error summary for Check UAT (develop)

The job generated some errors, drill down into the full build log for more details.


BUILD FAILED
/home/bamboo/bamboo-agent-home/xml-data/build-dir/SFDC-CDAS-JOB1/build.xml:751: The following error occurred while executing this line:
/home/bamboo/bamboo-agent-home/xml-data/build-dir/SFDC-CDAS-JOB1/build.xml:214:
*********** DEPLOYMENT FAILED ***********
Request ID: 0Afn000000MMt3sCAD

All Component Failures:
1.  objects/dsfs__DocuSign_Recipient_Status__c.object (dsfs__DocuSign_Recipient_Status__c.dsfs__Decline_Reason__c) -- Error: Cannot modify managed object: entity=CustomFieldDefinition, component=00NF000000BiCwL, field=MasterLabel, state=installed: newValue='Decline Reason', oldValue='Declined Reason' (line 156, column 13)
2.  reportTypes/TRM_Contacts_with_Task_Activities.reportType -- Error: Could not find field EmailMessage in table Activity

*********** DEPLOYMENT FAILED ***********


Total time: 19 minutes 11 seconds