Build #322

Build: #322 failed Scheduled with changes by 5 people

Build result summary

Details

Completed
Duration
16 minutes
Labels
None
Agent
(elastic) Elastic Agent on i-0455eea892ac34120
Revision
4cc80e10c40fa4deb4c896ace4b1c1ae51849d70 4cc80e10c40fa4deb4c896ace4b1c1ae51849d70
Failing since
#239 (Scheduled with changes by rashmi narayanan and Narayanan <kpnz317@astrazeneca.net>)

No failed tests found, a possible compilation error occurred.

Responsible

Code commits

Author Commit Message Commit date
Mohammed Abdul Qadeer &lt;a.qadeer@gmail.com&gt; Mohammed Abdul Qadeer <a.qadeer@gmail.com> 4cc80e10c40fa4deb4c896ace4b1c1ae51849d70 4cc80e10c40fa4deb4c896ace4b1c1ae51849d70 Merged in feature_falcon (pull request #1044)
FAL-139: Missing Budget VF Pages

Approved-by: Jaiganesh Vaidyalingam <jaiganesh.vaidyalingam@astrazeneca.com>
Mohammed Abdul Qadeer(Deloitte) &lt;a.qadeer@gmail.com&gt; Mohammed Abdul Qadeer(Deloitte) <a.qadeer@gmail.com> 22bb5b77b3e4b74b4ada022cbe77ff002c731a18 22bb5b77b3e4b74b4ada022cbe77ff002c731a18 FAL-139: Updated Falcon Foundation Permission set
Mohammed Abdul Qadeer &lt;a.qadeer@gmail.com&gt; Mohammed Abdul Qadeer <a.qadeer@gmail.com> 7743c6926036ef0a0030bdcf01b58ae11f6547dd 7743c6926036ef0a0030bdcf01b58ae11f6547dd Merged develop into feature_falcon
Mohammed Abdul Qadeer(Deloitte) &lt;a.qadeer@gmail.com&gt; Mohammed Abdul Qadeer(Deloitte) <a.qadeer@gmail.com> d6a6c03ea2d129862efacd5f2c83552b62cb336b m d6a6c03ea2d129862efacd5f2c83552b62cb336b FAL-139: Missing Budget VF Pages
Prakash Baskaran Prakash Baskaran 993624da629945106279394a88b5323c7d562d62 993624da629945106279394a88b5323c7d562d62 Merged in feature_nucleus (pull request #1040)
CRM-664 TECB-3770

JIRA issues

IssueDescriptionStatus
Unknown Issue TypeCRM-664Could not obtain issue details from JIRA
Unknown Issue TypeFAL-139Could not obtain issue details from JIRA
Unknown Issue TypeTECB-3770Could not obtain issue details from JIRA

Error summary for Check Production (develop)

The job generated some errors, drill down into the full build log for more details.


BUILD FAILED
/home/bamboo/bamboo-agent-home/xml-data/build-dir/SFDC-CDAP-JOB1/build.xml:34: The following error occurred while executing this line:
/home/bamboo/bamboo-agent-home/xml-data/build-dir/SFDC-CDAP-JOB1/build.xml:144:
*********** DEPLOYMENT FAILED ***********
Request ID: 0Af2A00000Anx6GSAR

All Component Failures:
1.  pages/AZ_ocms_NucleusSlideLoader_Edit.page -- Error: The specified Package Version number does not exist for that Package: ocms_socfp, 3.2
2.  objects/AZ_Driver_Profile__c.object (AZ_Driver_Profile__c.Market__c) -- Error: duplicate value found: <unknown> duplicates value on record with id: <unknown> (line 149, column 13)
3.  reports/ARCH-meta.xml -- Error: An unexpected error occurred. Please include this ErrorId if you contact support: 207042901-27055 (86536500)
4.  classes/NucleusUtilityAddUsersToOrchProfile.cls-meta.xml -- Error: The specified Package Version number does not exist for that Package: cms, 8.67
5.  classes/NucleusUtilityDelUsersFromOrchProfile.cls-meta.xml -- Error: The specified Package Version number does not exist for that Package: cms, 8.67
6.  classes/OrchestraCMSProfileManager.cls-meta.xml -- Error: The specified Package Version number does not exist for that Package: cms, 8.67
7.  classes/NucleusUtilityAddUsersToOrchProfileTest.cls -- Error: Invalid type: NucleusUtilityAddUsersToOrchProfile (line 103, column 49)
8.  triggers/AddUserToOrchestraCMS.trigger -- Error: Variable does not exist: OrchestraCMSProfileManager (line 27, column 32)
9.  permissionsets/AZ_Academy_Learning_Administrator.permissionset -- Error: Permission InboundMigrationToolsUser depends on permission(s): ConvertLeads, EditPublicDocuments, ImportLeads, ModifyAllData, SolutionImport, TransferAnyLead, ViewAllData

*********** DEPLOYMENT FAILED ***********


Total time: 10 minutes 19 seconds