Build: #30 failed Changes by Arun Subramanian

Build result summary

Details

Completed
Duration
2 minutes
Labels
None
Revision
90a4a5ad8963b2ffb3e1427e89de0fea6a93b261 90a4a5ad8963b2ffb3e1427e89de0fea6a93b261
Failing since
#14 (Changes by Arun Subramanian and mail4thiyagu <mail4thiyagu@gmail.com>)

No failed tests found, a possible compilation error occurred.

Responsible

Code commits

Author Commit Message Commit date
Arun Subramanian Arun Subramanian 90a4a5ad8963b2ffb3e1427e89de0fea6a93b261 90a4a5ad8963b2ffb3e1427e89de0fea6a93b261 Merged in release (pull request #115)
CRM-556
Arun Subramanian Arun Subramanian 0f153b04923dce6da3aef8105699e21fd112e443 m 0f153b04923dce6da3aef8105699e21fd112e443 Merged in develop (pull request #114)
CRM-556
kalpanam &lt;KALPANAMFORCE@GMAIL.COM&gt; kalpanam <KALPANAMFORCE@GMAIL.COM> c357c59128089e379f4d2c5b622909aea1782daa m c357c59128089e379f4d2c5b622909aea1782daa Merged in feature_icontact (pull request #113)
CRM-556
M &lt;klfb670@astrazeneca.net&gt; M <klfb670@astrazeneca.net> 1adcd3d81243ca9db6141d5f35a67d03c9f9654b m 1adcd3d81243ca9db6141d5f35a67d03c9f9654b CRM-556

Configuration changes

Plan configuration has changed since the last successful build. See the plan audit log for more details.

JIRA issues

IssueDescriptionStatus
Unknown Issue TypeCRM-556Could not obtain issue details from JIRA

Error summary for Default Job

The job generated some errors, drill down into the full build log for more details.


BUILD FAILED
/home/bamboo/bamboo-agent-home/xml-data/build-dir/AZNA-DDTS-JOB1/build.xml:89:
*********** DEPLOYMENT FAILED ***********
Request ID: 0Af7A00000FIUeRSAX

All Component Failures:
1.  classes/Account_Trigger_Helper_AZ_US.cls -- Error: No such column 'Blacklist_All_MCRM__c' on entity 'Account'. If you are attempting to use a custom field, be sure to append the '__c' after the custom field name. Please reference your WSDL or the describe call for the appropriate names. (line 264, column 22)
2.  classes/AdvancedSearchController_AZ_US.cls -- Error: Dependent class is invalid and needs recompilation:
    IC_MCRM_ResponseParserClass: line 69, column 13: Invalid field CorpOptInSync__c for SObject Account (line 311, column 61)
3.  classes/Web2CaseService_AZ_US.cls -- Error: Dependent class is invalid and needs recompilation:
    Class.AdvancedSearchController_AZ_US.setAttributesForConsumer: line 311, column 61
    IC_MCRM_ResponseParserClass: line 69, column 13: Invalid field CorpOptInSync__c for SObject Account (line 99, column 73)
4.  classes/IC_MCRM_ResponseParserClass.cls -- Error: Invalid field CorpOptInSync__c for SObject Account (line 69, column 13)
5.  classes/IC_MCRM_Consumer_Opt_BatchClass.cls -- Error: Invalid field corpOptInSync__c for SObject Account (line 37, column 25)
6.  classes/IC_MCRM_BatchClass.cls -- Error: Dependent class is invalid and needs recompilation:
    IC_MCRM_Consumer_Opt_BatchClass: line 37, column 25: Invalid field corpOptInSync__c for SObject Account (line 70, column 37)
7.  classes/Email2CaseService_AZ_US.cls -- Error: Dependent class is invalid and needs recompilation:
    Class.AdvancedSearchController_AZ_US.setAttributesForConsumer: line 311, column 61
    IC_MCRM_ResponseParserClass: line 69, column 13: Invalid field CorpOptInSync__c for SObject Account (line 137, column 73)
8.  classes/CaseSurveyController.cls -- Error: Method does not exist or incorrect signature: Account_Trigger_Helper_AZ_US.MCRM_ConsumerUpdate(Id, Id) (line 147, column 5)
9.  triggers/AccountAfterTrigger.trigger -- Error: Method does not exist or incorrect signature: Account_Trigger_Helper_AZ_US.MCRM_ConsumerUpdate(String, NULL) (line 8, column 13)
10.  pages/Case_Survey.page -- Error: Apex class 'CaseSurveyController' does not exist
11.  pages/Case_Survey_Form.page -- Error: Apex class 'CaseSurveyController' does not exist

*********** DEPLOYMENT FAILED ***********


Total time: 2 minutes 14 seconds