Build: #227 failed Manual run by Bruce Meehan

Build result summary

Details

Completed
Duration
1 minute
Labels
None
Agent
(elastic) Elastic Agent on i-0eff3b427668af60c
Revision
0a5d7eeab39a3c980316f4c06c23a8ce003abfe5 0a5d7eeab39a3c980316f4c06c23a8ce003abfe5
Failing since
#224 (Manual run by Bruce Meehan)

No failed tests found, a possible compilation error occurred.

Responsible

This build has been failing since #224
No one has taken responsibility

Code commits

Author Commit Message Commit date
Bruce Meehan Bruce Meehan 0a5d7eeab39a3c980316f4c06c23a8ce003abfe5 0a5d7eeab39a3c980316f4c06c23a8ce003abfe5 Merged develop into feature_callcare
Bruce Meehan Bruce Meehan cb22d6eda5021539fefc890f63244936dc19d2f1 m cb22d6eda5021539fefc890f63244936dc19d2f1 Adding new Ant Buildfile for azcc01
Ana Garcia Ana Garcia 6ab1b74cba79733b4f6a2462a25dea0af36f9d24 m 6ab1b74cba79733b4f6a2462a25dea0af36f9d24 Merged release into develop
Ana Garcia Ana Garcia ece8c2bbbf3d7a426bb883ecc091f8d8bafab79f m ece8c2bbbf3d7a426bb883ecc091f8d8bafab79f Merged develop into release

Error summary for Test Deployment

The job generated some errors, drill down into the full build log for more details.


BUILD FAILED
/home/bamboo/bamboo-agent-home/xml-data/build-dir/AZ-TPFRA3-JOB1/build-azcc01.xml:331: The following error occurred while executing this line:
/home/bamboo/bamboo-agent-home/xml-data/build-dir/AZ-TPFRA3-JOB1/build-azcc01.xml:227:
*********** DEPLOYMENT FAILED ***********
Request ID: 0Af3600001ZkvK3CAJ

All Component Failures:
1.  layouts/Macro-Macro Layout.layout -- Error: Layout must contain an item for required layout field: StartingContext

*********** DEPLOYMENT FAILED ***********


Total time: 1 minute 21 seconds