Build: #4 failed Manual run by Bruce Meehan

Build result summary

Details

Completed
Duration
4 minutes
Labels
None
Agent
(elastic) Elastic Agent on i-0140f909c366dbce8
Revision
21e1211a93a5d1007f982d0382544b3279ade9ea 21e1211a93a5d1007f982d0382544b3279ade9ea
Failing since
#1 (Rebuilt by Bruce Meehan)

No failed tests found, a possible compilation error occurred.

Responsible

This build has been failing since #1
No one has taken responsibility

Error summary for Continuous Integration

The job generated some errors, drill down into the full build log for more details.


BUILD FAILED
/home/bamboo/bamboo-agent-home/xml-data/build-dir/AZ-TF-JOB1/build-azcc01.xml:90: The following error occurred while executing this line:
/home/bamboo/bamboo-agent-home/xml-data/build-dir/AZ-TF-JOB1/build-azcc01.xml:134:
*********** DEPLOYMENT FAILED ***********
Request ID: 0AfR000000HFU2ZKAX

All Component Failures:
1.  objects/PersonAccount.object -- Error: An unknown exception has occurred.
2.  objects/Case.object (Case.Master Case Support Process) -- Error: Picklist value: Callback not found (line 59, column 24)
3.  objects/Case.object (Case.Support Process) -- Error: Picklist value: Cancelled not found (line 96, column 24)
4.  objects/Case.object (Case.Adverse_Event) -- Error: Picklist value: DTC in picklist: Type not found (line 1359, column 18)
5.  objects/Case.object (Case.General_Call) -- Error: Picklist value: Fax in picklist: Origin not found (line 1752, column 18)
6.  objects/Case.object (Case.Materials_Request) -- Error: Picklist value: Fax in picklist: Origin not found (line 2157, column 18)
7.  objects/Case.object (Case.Programs) -- Error: Picklist value: DTC in picklist: Type not found (line 2562, column 18)
8.  objects/Case.object (Case.Quick_Close) -- Error: Picklist value: Fax in picklist: Origin not found (line 2955, column 18)
9.  objects/Case.object (Case.Savings_Card) -- Error: Picklist value: DTC in picklist: Type not found (line 3357, column 18)
10.  objects/Task.object (Task.New) -- Error: Picklist value: Closed in picklist: Status not found (line 102, column 18)
11.  reportTypes/Cases_and_Activities.reportType -- Error: In field: field - no CustomField named CC_Case_Activity__c.Media_Description__c found (line 68, column 18)
12.  reports/Supervisor_Reports/Call_Activity_by_Brand_DNIS.report -- Error: In field: CC_Case_Activity__c.Media_Description__c - no CustomField named CC_Case_Activity__c.Media_Description__c found (line 12, column 14)
13.  reports/Supervisor_Reports/Calls_by_brand_and_disposition.report -- Error: In field: CC_Case_Activity__c.Media_Description__c - no CustomField named CC_Case_Activity__c.Media_Description__c found (line 12, column 14)
14.  reports/Supervisor_Reports/Custom_Case_Detail_report_per_Agents.report -- Error: filterlanguage: Invalid value specified: 1.
15.  layouts/CC_Product__c-Brand Layout.layout -- Error: In field: field - no CustomField named CC_Product__c.PrePrintedCard__c found (line 38, column 26)
16.  layouts/CC_Product__c-Product Layout.layout -- Error: In field: field - no CustomField named CC_Product__c.PrePrintedCard__c found (line 38, column 26)
17.  objectTranslations/CC_Product__c-en_US.objectTranslation -- Warning: Couldn't locate layout section:Custom Links in layout:Brand Layout (line 66, column 19)
18.  objectTranslations/CC_Product__c-en_US.objectTranslation -- Warning: Couldn't locate layout section:PSKW Information in layout:Brand Layout (line 70, column 19)
19.  objectTranslations/CC_Product__c-en_US.objectTranslation -- Warning: Couldn't locate layout section:Custom Links in layout:Product Layout (line 77, column 19)
20.  objectTranslations/CC_Product__c-en_US.objectTranslation -- Warning: Couldn't locate layout section:PSKW Information in layout:Product Layout (line 81, column 19)
21.  profiles/DTC-Admin.profile -- Error: Permission ModifyAllData depends on permission(s): EditPublicReports, ManageDashboards
22.  profiles/DTC-Supervisor.profile -- Error: In field: recordType - no RecordType named Account.Virtual_AZ found (line 2510, column 29)
23.  profiles/DTC-Manager.profile -- Error: In field: recordType - no RecordType named Account.Virtual_AZ found (line 2328, column 29)
24.  profiles/DTC-Agent.profile -- Error: In field: recordType - no RecordType named Account.Virtual_AZ found (line 2577, column 29)
25.  permissionsets/DTC_Admin.permissionset -- Error: In field: field - no CustomField named CC_Product__c.PrePrintedCard__c found
26.  permissionsets/DTC_Manager.permissionset -- Error: In field: field - no CustomField named CC_Product__c.PrePrintedCard__c found
27.  permissionsets/DTC_Agent.permissionset -- Error: In field: field - no CustomField named CC_Product__c.PrePrintedCard__c found
28.  objects/Case.object -- Error: No such standard button to exclude Forward (line 3750, column 20)

*********** DEPLOYMENT FAILED ***********


Total time: 2 minutes 49 seconds