Build: #15 failed Changes by Daniel Na

Build result summary

Details

Completed
Duration
2 minutes
Labels
None
Agent
(elastic) Elastic Agent on i-02fa886d32e24b25d
Revision
518100c84ba26c4cb7864caa8897b6f5f4568728 518100c84ba26c4cb7864caa8897b6f5f4568728
Failing since
#7 (Changes by Daniel Na)
Fixed in
#22 (Changes by Daniel Na)

No failed tests found, a possible compilation error occurred.

Responsible

Code commits

Author Commit Message Commit date
Daniel Na Daniel Na 518100c84ba26c4cb7864caa8897b6f5f4568728 518100c84ba26c4cb7864caa8897b6f5f4568728 CAZIC-619 Pushing Prescriber.

JIRA issues

IssueDescriptionStatus
Unknown Issue TypeCAZIC-619Could not obtain issue details from JIRA

Error summary for Continuous Integration

The job generated some errors, drill down into the full build log for more details.


BUILD FAILED
/home/bamboo/bamboo-agent-home/xml-data/build-dir/AC-TSA-JOB1/build-azcc01.xml:372: The following error occurred while executing this line:
/home/bamboo/bamboo-agent-home/xml-data/build-dir/AC-TSA-JOB1/build-azcc01.xml:227:
*********** DEPLOYMENT FAILED ***********
Request ID: 0Af290000093MurCAE

Code Coverage Failures:
1.  Average test coverage across all Apex Classes and Triggers is 55%, at least 75% test coverage is required.
*********** DEPLOYMENT FAILED ***********


Total time: 2 minutes 26 seconds