Build: #413 failed Changes by S D <kcqr412@astrazeneca.net>

Build result summary

Details

Completed
Duration
1 minute
Labels
None
Agent
(elastic) Elastic Agent on i-0e9d6110b5aefd88b
Revision
b8b97e45f87e4d1d8e655a038699f6b50da69ca8 b8b97e45f87e4d1d8e655a038699f6b50da69ca8

No failed tests found, a possible compilation error occurred.

Responsible

No one has taken responsibility for this failure

Code commits

Author Commit Message Commit date
S D &lt;kcqr412@astrazeneca.net&gt; S D <kcqr412@astrazeneca.net> b8b97e45f87e4d1d8e655a038699f6b50da69ca8 b8b97e45f87e4d1d8e655a038699f6b50da69ca8 CRM-809

JIRA issues

IssueDescriptionStatus
Unknown Issue TypeCRM-809Could not obtain issue details from JIRA

Error summary for Continuous Integration

The job generated some errors, drill down into the full build log for more details.


BUILD FAILED
/home/bamboo/bamboo-agent-home/xml-data/build-dir/AA-ATP-JOB1/build-academies.xml:34: The following error occurred while executing this line:
/home/bamboo/bamboo-agent-home/xml-data/build-dir/AA-ATP-JOB1/build-academies.xml:549:
*********** DEPLOYMENT FAILED ***********
Request ID: 0Af2A00000BPDvOSAX

All Component Failures:
1.  workflows/Curriculum_Progress__c.workflow (Curriculum_Progress__c.SendEmailToLineManager) -- Error: You must specify a verified Org Wide Email Address for this sender type. (line 3, column 13)
2.  workflows/Course_Progress__c.workflow (Course_Progress__c.SendEmailToLineManagerCourseProgress) -- Error: You must specify a verified Org Wide Email Address for this sender type. (line 15, column 13)

*********** DEPLOYMENT FAILED ***********


Total time: 1 minute 20 seconds